{"text_format":"1","workbook":"xlsx","n_sheets":2,"sheets":["SR650a V4 with 1xCPU","SR650a V4 with 2xCPU"],"not_rendered":{"charts":0,"images":0,"macros":0,"external_links":2,"defined_names":2,"comments":0,"pivot_tables":0},"unopened":[],"bounds":{"document_bytes":16777216,"sheet_cells":100000,"rows_first":2000,"rows_last":500,"rows_between":2000,"halvings":0,"cell_chars":16384,"cell_head_chars":4096},"cells_cut":0,"cells_raw":0,"read":"whole","date_system":"1900"}

{"sheet":"SR650a V4 with 1xCPU","index":0,"n_rows":17,"n_cols":20,"rows_kept":17,"cut":false,"hidden":false,"merged":[[11,17,12,17],[6,12,6,13],[5,12,5,13],[4,12,4,13],[11,0,12,0],[10,1,10,2],[11,1,12,1],[11,2,12,2],[11,12,12,12],[10,12,10,16],[11,3,12,3],[11,14,12,14],[11,15,12,15],[11,16,12,16],[1,1,1,4],[1,5,1,7],[1,8,1,11],[3,12,3,13],[1,12,1,16],[16,12,16,13],[15,12,15,13],[14,12,14,13],[13,12,13,13],[11,13,12,13]]}
["The following lists the PCIe slot installation rules for servers with one processor and 8 x 2.5\" front drive bays. For detailed configurations, see https://dcsc.lenovo.com."]
["SR650a V4 8x2.5\"","Hot Swap - Front\n(A Zone)",null,null,null,"Simple Swap - Mid\n(B Zone)",null,null,"Hot Swap - Rear\n(C Zone)",null,null,null,"1P"]
["Config","2.5\" SAS/SATA","2.5\" NVMe","2.5\" AnyBay","U.3","3.5\" SAS/SATA","2.5\" SAS/SATA","2.5\" NVMe","3.5\" SAS/SATA","2.5\" SAS/SATA","2.5\" NVMe","2.5\" AnyBay","Slot1","Slot2","Slot3","Slot4","Slot5",null,null,"CPU Qty's"]
[73,8,null,null,null,null,null,null,null,null,null,null,"N/A\n(Front riser)",null,"V\n(Non- x8 cable riser for x16 OCP1)\n(Non- x8 cable riser&x8 OCP1 for CFF)","V","V",null,null,{"$f":"VLOOKUP(H4,'[2]BHS 2U Storage Configs_90'!$A:$BM,65,0)","v":{"$error":"#N/A"}}]
[77,null,null,null,8,null,null,null,null,null,null,null,"N/A\n(Front riser)",null,"V\n(Non- x8 cable riser for x16 OCP1)\n(Non- x8 cable riser&x8 OCP1 for CFF)","V","V",null,null,{"$f":"VLOOKUP(H5,'[2]BHS 2U Storage Configs_90'!$A:$BM,65,0)","v":{"$error":"#N/A"}}]
[80,8,null,null,null,null,null,null,null,null,null,null,"N/A\n(Front riser)",null,"V\n(Non- x8 cable riser for x16 OCP1)\n(Non- x8 cable riser&x8 OCP1 for CFF)","V","V",null,null,{"$f":"VLOOKUP(H6,'[2]BHS 2U Storage Configs_90'!$A:$BM,65,0)","v":{"$error":"#N/A"}}]
[84,null,null,null,8,null,null,null,null,null,null,null,"N/A\n(Front riser)",null,"V\n(Non- x8 cable riser for x16 OCP1)\n(Non- x8 cable riser&x8 OCP1 for CFF)","V","V",null,null,{"$f":"VLOOKUP(H7,'[2]BHS 2U Storage Configs_90'!$A:$BM,65,0)","v":{"$error":"#N/A"}}]
[]
[]
["The following lists the PCIe slot installation rules for servers with one processor and E3.S front drive bays. For detailed configurations, see https://dcsc.lenovo.com."]
["SR650a V4 E3.S 1T","Hot Swap - Front\n(A Zone)",null,null,null,null,null,null,null,null,null,null,"1P"]
["Config","E3.S 1T drive","E3.S 2T CMM","BP Qty",null,null,null,null,null,null,null,null,"Slot1","Slot2","Slot3","Slot4","Slot5"]
[]
[111,4,null,1,null,null,null,null,null,null,null,null,"N/A\n(Front riser)",null,"V\n(Non- x8 cable riser for x16 OCP1)","N/A","V"]
[78,8,null,2,null,null,null,null,null,null,null,null,"N/A\n(Front riser)",null,"V\n(Only x8 cable riser)\n(Non- x8 cable riser for x16 OCP1)","N/A","N/A"]
[86,4,null,1,null,null,null,null,null,null,null,null,"N/A\n(Front riser)",null,"V\n(Non- x8 cable riser for x16 OCP1)","N/A","V"]
[85,8,null,2,null,null,null,null,null,null,null,null,"N/A\n(Front riser)",null,"V\n(Only x8 cable riser)\n(Non- x8 cable riser for x16 OCP1)","N/A","N/A"]

{"sheet":"SR650a V4 with 2xCPU","index":1,"n_rows":21,"n_cols":17,"rows_kept":21,"cut":false,"hidden":false,"merged":[[8,13,8,14],[5,13,5,14],[6,5,6,6],[6,13,6,14],[7,5,7,6],[7,13,7,14],[5,5,5,6],[1,5,1,14],[14,1,14,2],[15,0,16,0],[15,2,16,2],[15,3,16,3],[15,1,16,1],[1,1,1,4],[9,13,9,14],[9,5,9,6],[8,5,8,6],[3,5,3,6],[3,13,3,14],[4,5,4,6],[4,13,4,14],[10,5,10,6],[10,13,10,14],[20,13,20,14],[20,5,20,6],[18,13,18,14],[18,5,18,6],[17,13,17,14],[17,5,17,6],[19,13,19,14],[19,5,19,6],[15,16,16,16],[14,5,14,14],[15,5,16,5],[15,6,16,6],[15,7,16,7],[15,8,16,8],[15,9,16,9],[15,10,16,10],[15,11,16,11],[15,12,16,12],[15,13,16,13],[15,14,16,14],[15,15,16,15]]}
["The following lists the PCIe slot installation rules for servers with one processor and 8 x 2.5\" front drive bays. For detailed configurations, see https://dcsc.lenovo.com."]
["SR650a V4 8x2.5\"","Hot Swap - Front\n(A Zone)",null,null,null,"2P"]
["Config","2.5\" SAS/SATA","2.5\" NVMe","2.5\" AnyBay","U.3","Slot1","Slot2","Slot3","Slot4","Slot5","Slot6","Slot7","Slot8","Slot9","Slot10",null,"CPU Qty's"]
[73,8,null,null,null,"N/A\n(Front riser)",null,"V\n(Non- x8 cable riser for x16 OCP1)","V","V","V\n(Non- x8 riser for CFF)","V","V","N/A\n(Front riser)",null,null,"1P/2P"]
[74,null,8,null,null,"N/A\n(Front riser)",null,"V\n(Non- x8 cable riser for x16 OCP1)","N/A","V","N/A\n(Power14 for BP1 )","V","N/A","N/A\n(Front riser)",null,null,"2P"]
[75,null,null,8,null,"N/A\n(Front riser)",null,"V\n(Non- x8 cable riser for x16 OCP1)","N/A","V","N/A\n(Power14 for BP1 )","V","N/A","N/A\n(Front riser)",null,null,"2P"]
[77,null,null,null,8,"N/A\n(Front riser)",null,"V\n(Non- x8 cable riser for x16 OCP1)","V","V","V\n(Non- x8 cable riser for CFF)","V","V","N/A\n(Front riser)",null,null,"1P/2P"]
[80,8,null,null,null,"N/A\n(Front riser)",null,"V\n(Non- x8 cable riser for x16 OCP1)","V","V","V\n(Non- x8 cable riser for CFF)","V","V","N/A\n(Front riser)",null,null,"1P/2P"]
[81,null,8,null,null,"N/A\n(Front riser)",null,"V\n(Non- x8 cable riser for x16 OCP1)","N/A","V","V\n(Only x8 cable riser)","V","N/A","N/A\n(Front riser)",null,null,"2P"]
[82,null,null,8,null,"N/A\n(Front riser)",null,"V\n(Non- x8 cable riser for x16 OCP1)","N/A","V","V\n(Only x8 cable riser)\n(Non- x8 cable riser for CFF)","V","N/A","N/A\n(Front riser)",null,null,"2P"]
[84,null,null,null,8,"N/A\n(Front riser)",null,"V\n(Non- x8 cable riser for x16 OCP1)","V","V","V\n(Non- x8 cable riser for CFF)","V","V","N/A\n(Front riser)",null,null,"1P/2P"]
[]
[]
["The following lists the PCIe slot installation rules for servers with two processors and E3.S front drive bays. For detailed configurations, see https://dcsc.lenovo.com."]
["SR650a V4 E3.S 1T","Hot Swap - Front\n(A Zone)",null,null,null,"2P"]
["Config","E3.S 1T drive","E3.S 2T CMM","BP Qty",null,"Slot1","Slot2","Slot3","Slot4","Slot5","Slot6","Slot7","Slot8","Slot9","Slot10",null,"CPU Qty's"]
[null,null,null,null,null,null,null,null,null,null,null,null,null,null,null,null,{"$error":"#N/A"}]
[111,4,null,1,null,"N/A\n(Front riser)",null,"V\n(Non- x8 cable riser for x16 OCP1)","N/A","V","V","V","V","N/A\n(Front riser)",null,null,"1P/2P"]
[78,8,null,2,null,"N/A\n(Front riser)",null,"V\n(Non- x8 cable riser for x16 OCP1)","N/A","V","V","N/A","V","N/A\n(Front riser)",null,null,"1P/2P"]
[86,4,null,1,null,"N/A\n(Front riser)",null,"V\n(Non- x8 cable riser for x16 OCP1)","N/A","V","V","V","V","N/A\n(Front riser)",null,null,"1P/2P"]
[85,8,null,2,null,"N/A\n(Front riser)",null,"V\n(Non- x8 cable riser for x16 OCP1)","N/A","V","V","N/A","V","N/A\n(Front riser)",null,null,"1P/2P"]